BDBM50319694 (+/-)-2-Amino-(bis-2-chloroethyl)-5-aminoindane-2-carboxylic acid::CHEMBL1084594
SMILES NC1(Cc2ccc(cc2C1)N(CCCl)CCCl)C(O)=O
InChI Key InChIKey=YOYUWLUUYLEOJW-UHFFFAOYSA-N
Data  1 KI
  Tab Delimited (TSV)   2D SDfile   Computed 3D by Vconf -m prep SDfile
Find this compound or compounds like it in BindingDB:
Activity Spreadsheet -- Enzyme Inhibition Constant Data from BindingDB
Found 1 hit for monomerid = 50319694
TargetLarge neutral amino acids transporter small subunit 1(Rattus norvegicus)
University Of Kentucky
Curated by ChEMBL
LigandPNGBDBM50319694((+/-)-2-Amino-(bis-2-chloroethyl)-5-aminoindane-2-...)
Affinity DataKi:  5.00E+3nM. Assay description: Inhibition of LAT1-mediated L-[14C]-leucine uptake in Sprague-Dawley rat brain by duel-labeled liquid scintillation counting
In DepthDetails ArticlePubMed